{"text_format":"1","workbook":"xlsx","n_sheets":16,"sheets":["Notes","Instructions","BaselineParameters","REFERENCE","1- pre screen","2- Proposal","3- Study Inputs","4- Study Results","5- Incremental Costs","Summary","6- Baseline Hourly Results","7- Proposed Hourly Results","Prescreening Review","Proposal Review","Study Review","Financial Model inputs"],"not_rendered":{"charts":0,"images":4,"macros":1,"external_links":0,"defined_names":16,"comments":7,"pivot_tables":0},"unopened":[],"bounds":{"document_bytes":16777216,"sheet_cells":100000,"rows_first":2000,"rows_last":500,"rows_between":2000,"halvings":0,"cell_chars":16384,"cell_head_chars":4096},"cells_cut":0,"cells_raw":0,"read":"whole","date_system":"1900"}

{"sheet":"Notes","index":0,"n_rows":23,"n_cols":2,"rows_kept":23,"cut":false,"hidden":true,"merged":[]}
[null,"Concept design (LCE Baseline) energy model does not change from pre-screening going forward to proposal and study submission."]
[null,"Pre-screen to be submitted before kick off meeting and after doing the concept design modelling"]
[null,"Fill the pre-screening sheet for each building where there is good potential for electrification."]
[null,"Proposal to be submitted after kick off meeting"]
[]
[]
[null,"A clear EM is a measure that saves GHG and increases electricity."]
[null,"All ECMs (gas and/or electric) or EMs all must be included in final proposed bundle model."]
[null,"Electric ECMs (saving only electricity) will not be modelled separately. GHG, energy, costing impacts of these ECMs must be equaly included in both baseline and porposed models."]
[null,"Non-fuel-switching gas saving measures (e.g. low flow fixtures, condensing boilers, etc.) should not be modelled separately. They are to be included in EM models and bundle model."]
{"$rows_left_out":14}
{"sheet":"Instructions","index":1,"n_rows":68,"n_cols":3,"rows_kept":68,"cut":false,"hidden":false,"merged":[[54,0,54,12],[32,0,32,12],[35,0,35,12],[20,0,20,11],[50,0,50,12],[46,0,46,12],[37,0,37,12],[42,0,42,12],[44,0,44,12],[39,0,39,12],[28,0,28,12],[5,0,5,12],[8,1,8,12],[9,1,9,12],[10,1,10,12],[24,0,24,12],[17,2,17,12],[18,2,18,12]]}
["CleanBC New Construction Incentives"]
["Energy Modeling Study Proposal and Report Workbook"]
[]
["Introduction"]
[]
["This workbook has been developed for the CleanBC New Construction Incentives (the Program) to standardize the energy modeling study reporting format and provide consultants performing the work the  minimum inputs/results information required for the technical review and proposal/study approval process. This workbook is to be completed as part of the requirements for energy study funding under the Program and it has to be submitted to BC Hydro in its original electronic format. \n\nAt the project eligibility assessment stage, this workbook (with Pre-Screen worksheet filled out) is to be submitted along with associated preliminary calculations / estimates that support the electrical load growth and fuel offset claims. The data provided will be evaluated by the Program's engineering team and, if accepted, the project will proceed to project application stage.\n\nAt the project application stage, this workbook (with Proposal worksheet filled out) is to be submitted along with project application and consultants' proposal(s). The consultant's proposal(s) do not need to contain project technical details, but just  a reference to this workbook (Proposal worksheet tab). Information provided in this workbook need not be duplicated in the Consultants' proposal(s).  \n\nAt the study report submission stage, this workbook is the only document required by BC Hydro for review. Consultants are welcome to organize and present study results to the customer in a different format. If required, consultants are also welcome to add additional worksheets to the end of this workbook with additional calculations and project details.\n\nThe workbook has been formatted to minimize re-entering data and shall be filled out in the following order:"]
[]
["Worksheet tab color-coding conventions"]
[null,"Black worksheets are input worksheets. "]
[null,"White worksheets are filled automatically."]
{"$rows_left_out":59}
{"sheet":"BaselineParameters","index":2,"n_rows":85,"n_cols":10,"rows_kept":85,"cut":false,"hidden":false,"merged":[]}
["Building Type","Location","ASHRAE Climate Zone","Step","Design Infiltration Rate (m3/s/m2 envelope area)","HRV Effectiveness","TEDI (kWh/m2)","GHG (kgCO2/m2)","Enevelope Surface Heat Loss (Opaque + Window), W/m2","Infiltration Heat Loss, W/m2"]
["MURB","Vancouver","Climate Zone 4","Step Code 1",2.5000000000000001E-4,"None",62.220884359999999,11.07634271,27.796003898635476,5.9468591617933715]
["MURB","Vancouver","Climate Zone 4","Step Code 2",2.5000000000000001E-4,0.6,40.623692599999998,6.1632938939999997,27.814780701754387,4.8217334307992203]
["MURB","Vancouver","Climate Zone 4","Step Code 3",1E-4,0.6,28.232626230000001,6.0027645400000003,23.474563840155948,1.9476659356725143]
["MURB","Vancouver","Climate Zone 4","Step Code 4",1.0000000000000001E-5,0.6,14.24695766,5.790910888,15.972102826510721,0.16824015594541911]
["MURB","Kamloops","Climate Zone 5","Step Code 1",2.5000000000000001E-4,"None",74.511951280000005,12.119135,44.245338693957109,8.4671710526315795]
["MURB","Kamloops","Climate Zone 5","Step Code 2",2.5000000000000001E-4,0.6,44.076813440000002,6.2651899000000002,37.761776315789476,6.7253299220272895]
["MURB","Kamloops","Climate Zone 5","Step Code 3",1E-4,0.6,29.87712938,6.0803965819999997,34.550601851851845,2.7076734892787524]
["MURB","Kamloops","Climate Zone 5","Step Code 4",1.0000000000000001E-5,0.8,14.77145335,5.8530522139999999,23.01348440545809,0.23064127680311888]
["MURB","Prince George","Climate Zone 6","Step Code 1",2.5000000000000001E-4,"None",83.202311030000004,14.14945065,34.753715886939574,5.234348927875244]
{"$rows_left_out":76}
{"sheet":"REFERENCE","index":3,"n_rows":90,"n_cols":34,"rows_kept":90,"cut":false,"hidden":true,"merged":[]}
["Climate Zone","Building Types",null,"Standard EMs (choose one)","EM EMLs","Sorting Options","Standard End Use","Energy Codes","Units","ICC Units",null,"Heating Source",null,null,null,null,"Yes/No",null,null,"Proposed Space Heating",null,null,"Exterior Wall Types",null,null,null,"Electricity Rates",null,null,null,null,null,"Proposed Space Heating"]
["GVRD and Victoria (ASHRAE Zone 4C)","Mixed Use",null,"HVAC Air Source VRF Distributed Heat Pumps",18,"Project #","Process HVAC","Step Code 1","Metric units","m2",null,"Electric",null,null,null,null,"Yes  ",null,null,null,"None",null,"Mass",null,null,null,"SGS","Small General Service",null,null,null,null,null,"None"]
["City of Vancouver and SFU (ASHRAE Zone 5)","Automotive Facility",null,"HVAC Water Source VRF Distributed Heat Pumps",22,"Project Name","Fans","Step Code 2","Imperial units","ft2",null,"Hybrid","elec and gas serve the same system",null,null,null,"No",null,null,null,"PTACand PTHP",null,"Metal Building",null,null,null,"MGS","Medium General Service",null,null,null,null,null,"PTAC"]
["BC Interior Kelowna, Vernon (ASHRAE Zone 5)","Convention Centre",null,"HVAC Water-to-Air Distributed Heat Pumps",18,"Building Type","Pumps","Step Code 3",null,"# of units",null,"DES",null,null,null,null,null,null,null,null,"PSZ-AC - Pack rooftop air conditioner CV",null,"Steel-framed",null,null,null,"LGS","Large General Service",null,null,null,null,null,"PTHP"]
["Vancouver Island except Victoria (ASHRAE Zone 5)","Courthouse",null,"HVAC Air-to-Air Heat Pump (ductless or minisplit)",18,"Area","DHW","Step Code 4",null,"L/s",null,"Natural Gas ",null,null,null,null,null,null,null,null,"Baseboard heating",null,"Wood-framed and Other",null,null,null,"TSR","Transmission Service Rate",null,null,null,null,null,"Hydronic Baseboard heating"]
["Coastal BC (ASHRAE Zone 5)","Dining: Bar/Lounge/Leisure",null,"HVAC Air-to-Water Heat Pump",15,"Climate Zone","Space Cooling","ASHRAE 90.1 2016",null,"CFM",null,"Renewable Natural Gas ",null,null,null,null,null,null,null,null,"VAV box (overhead and underfloor)",null,null,null,null,null,"RES 1","Residential Tier 1",null,null,null,null,null,"Electric Baseboard heating"]
["BC South Interior (ASHRAE Zone 6)","Dining: Cafeteria/Fast Food",null,"HVAC Electric Boiler",20,"Mech Consultant","Plug Load","NECB 2015",null,"TON",null,"Propane ",null,null,null,null,null,null,null,null,"Fan Coil unit",null,null,null,null,null,"RES 2","Residential Tier 2",null,null,null,null,null,"PSZ-AC - Pack rooftop air conditioner CV"]
["BC Interior (ASHRAE Zone 7)","Dining: Family",null,"HVAC Electric Water Heater",15,"Elec Consultant","Refrigeration",null,null,"kW",null,"Light Fuel Oil ",null,null,null,null,null,null,null,null,"Distributed heat pump ",null,null,null,null,null,null,null,null,null,null,null,null,"SZ-CV-HW Single-zone CV Chilled Water"]
["Northern BC (ASHRAE Zone 8)","Dormitory",null,"HVAC Exhaust Air Heat Recovery Heat Pump",15,null,"Elevators",null,null,"hp",null,"Heavy Fuel Oil ",null,null,null,null,null,null,null,null,"Thermal displacement ventilation",null,null,null,null,null,null,null,null,null,null,null,null,"Packaged VAV w/Reheat"]
["Lower Mainland and Victoria (NECB Zone 4)","Exercise Centre",null,"HVAC Ground Source Heat Pump",15,null,"IT Process Load",null,null,"GPM",null,"Kerosene ",null,null,null,null,null,null,null,null,"Chilled-beam",null,null,null,null,null,null,null,null,null,null,null,null,"VAV w/Reheat"]
{"$rows_left_out":81}
{"sheet":"1- pre screen","index":4,"n_rows":134,"n_cols":7,"rows_kept":134,"cut":false,"hidden":false,"merged":[[0,6,1,6],[24,1,24,2],[24,4,24,5],[102,0,114,6],[11,1,11,5],[2,0,2,1],[9,0,10,0],[31,1,31,4],[30,1,30,4],[84,0,96,6],[19,0,20,0],[21,1,21,5],[22,1,22,5],[14,0,15,0],[23,1,23,5]]}
["CleanBC New Construction Incentives",null,null,null,null,null,"CleanBC New Construction Workbook v2.0"]
["Project Eligibility Screening Sheet"]
["White, bordered cells for user inputs"]
[]
["Date submitted   (DD-MM-YYYY)",null,"Day-Month-Year"]
["Name of BC Hydro Key Account Manager (KAM)","KAM's name"]
[]
[]
[]
["Customer Information"]
{"$rows_left_out":125}
{"sheet":"2- Proposal","index":5,"n_rows":201,"n_cols":19,"rows_kept":201,"cut":false,"hidden":false,"merged":[[7,0,8,0],[9,1,9,5],[12,0,13,0],[20,0,21,0],[22,1,22,5],[23,1,23,5],[24,1,24,5],[25,1,25,2],[25,4,25,5],[2,0,2,1],[131,0,148,4],[120,16,120,17],[44,16,44,17],[48,16,48,17],[49,16,49,17],[69,15,69,17],[82,15,82,17],[100,15,100,17],[116,15,116,17],[121,15,121,17],[125,16,125,17],[118,1,118,2],[120,1,120,2],[122,1,122,2],[123,1,123,2],[117,6,117,7],[118,6,118,7],[120,6,120,7],[121,5,121,7],[125,1,125,2],[41,6,41,7],[38,1,38,2],[40,1,40,2],[46,1,46,2],[69,5,69,7],[82,5,82,7],[41,1,41,2],[59,6,59,7],[41,16,41,17],[81,11,81,12],[40,6,40,7],[39,6,39,7],[56,0,56,2],[62,0,62,2],[69,0,69,2],[57,6,57,7],[61,1,61,2],[50,0,50,2],[44,6,44,7],[48,6,48,7],[81,16,81,17],[43,5,43,7],[41,11,41,12],[49,11,49,12],[100,0,100,2],[60,1,60,2],[49,6,49,7],[56,5,56,7],[45,6,45,7],[46,6,46,7],[47,6,47,7],[50,10,50,12],[116,10,116,12],[110,1,110,2],[111,1,111,2],[58,1,58,2],[108,0,108,2],[59,1,59,2],[61,6,61,7],[57,1,57,2],[80,1,80,2],[80,6,80,7],[81,6,81,7],[110,6,110,7],[111,6,111,7],[81,1,81,2],[82,0,82,2],[58,11,58,12],[117,11,117,12],[50,5,50,7],[62,5,62,7],[100,5,100,7],[57,11,57,12],[82,10,82,12],[59,11,59,12],[80,11,80,12],[60,11,60,12],[60,6,60,7],[116,5,116,7],[115,6,115,7],[58,6,58,7],[100,10,100,12],[69,10,69,12],[62,10,62,12],[125,11,125,12],[119,1,119,2],[119,6,119,7],[119,11,119,12],[108,5,108,7],[108,10,108,12],[114,0,114,2],[114,5,114,7],[114,10,114,12],[110,11,110,12],[122,11,122,12],[123,11,123,12],[124,11,124,12],[120,11,120,12],[121,10,121,12],[121,0,121,2],[116,0,116,2],[124,1,124,2],[122,6,122,7],[123,6,123,7],[124,6,124,7],[125,6,125,7],[115,11,115,12],[118,11,118,12],[122,16,122,17],[123,16,123,17],[124,16,124,17],[38,6,38,7],[117,16,117,17],[118,16,118,17],[119,16,119,17],[33,0,33,2],[36,1,36,2],[35,1,35,2],[43,0,43,2],[44,1,44,2],[45,1,45,2],[42,1,42,2],[39,1,39,2],[37,1,37,2],[34,1,34,2],[48,1,48,2],[49,1,49,2],[47,1,47,2],[42,6,42,7],[117,1,117,2],[48,11,48,12],[111,11,111,12],[115,16,115,17],[45,16,45,17],[46,16,46,17],[47,16,47,17],[57,16,57,17],[56,15,56,17],[61,16,61,17],[50,15,50,17],[62,15,62,17],[58,16,58,17],[59,16,59,17],[108,15,108,17],[114,15,114,17],[60,16,60,17],[80,16,80,17],[111,16,111,17],[36,11,36,12],[37,11,37,12],[33,5,33,7],[36,6,36,7],[37,6,37,7],[34,6,34,7],[35,11,35,12],[38,11,38,12],[34,11,34,12],[0,7,1,7],[33,15,33,17],[36,16,36,17],[37,16,37,17],[34,16,34,17],[35,6,35,7],[56,10,56,12],[61,11,61,12],[110,16,110,17],[42,16,42,17],[43,15,43,17],[35,16,35,17],[40,16,40,17],[39,16,39,17],[42,11,42,12],[43,10,43,12],[38,16,38,17],[45,11,45,12],[46,11,46,12],[47,11,47,12],[39,11,39,12],[40,11,40,12],[44,11,44,12],[33,10,33,12]]}
["CleanBC New Construction Incentives",null,null,null,null,null,null,{"$f":"'1- pre screen'!G1:G2","v":"CleanBC New Construction Workbook v2.0"}]
["Energy Study Proposal"]
["White, bordered cells for user inputs",null,"BC Hydro Ref # >>>","BCH-00000"]
[null,null,"Proposal Date  >>>",null,"Day-Month-Year"]
[null,null,"Name of BC Hydro Key Account Manager (KAM)",{"$f":"'1- pre screen'!B6","v":"KAM's name"}]
["1. General Information"]
[]
["Customer Information"]
[]
["Organization",{"$f":"'1- pre screen'!B12:F12","v":"Organization name"}]
{"$rows_left_out":192}
{"sheet":"3- Study Inputs","index":6,"n_rows":131,"n_cols":19,"rows_kept":131,"cut":false,"hidden":false,"merged":[[32,0,32,2],[32,5,32,7],[32,10,32,12],[32,15,32,17],[33,1,33,2],[33,6,33,7],[33,11,33,12],[40,1,40,2],[40,6,40,7],[40,11,40,12],[40,16,40,17],[34,1,34,2],[34,6,34,7],[34,11,34,12],[34,16,34,17],[35,1,35,2],[35,6,35,7],[35,11,35,12],[35,16,35,17],[39,1,39,2],[39,6,39,7],[39,11,39,12],[39,16,39,17],[33,16,33,17],[43,1,43,2],[43,6,43,7],[43,11,43,12],[43,16,43,17],[44,1,44,2],[45,1,45,2],[41,1,41,2],[41,6,41,7],[41,11,41,12],[41,16,41,17],[42,0,42,2],[42,5,42,7],[42,10,42,12],[42,15,42,17],[44,6,44,7],[45,6,45,7],[44,11,44,12],[45,11,45,12],[44,16,44,17],[45,16,45,17],[38,1,38,2],[38,6,38,7],[38,11,38,12],[38,16,38,17],[36,1,36,2],[36,6,36,7],[36,11,36,12],[36,16,36,17],[37,1,37,2],[37,6,37,7],[37,11,37,12],[37,16,37,17],[49,0,49,2],[49,5,49,7],[49,10,49,12],[56,1,56,2],[57,1,57,2],[58,1,58,2],[49,15,49,17],[46,1,46,2],[47,1,47,2],[47,6,47,7],[47,11,47,12],[47,16,47,17],[48,1,48,2],[48,6,48,7],[48,11,48,12],[48,16,48,17],[46,6,46,7],[46,11,46,12],[46,16,46,17],[59,1,59,2],[59,6,59,7],[59,11,59,12],[59,16,59,17],[56,16,56,17],[57,16,57,17],[58,16,58,17],[55,0,55,2],[55,5,55,7],[55,10,55,12],[60,6,60,7],[60,11,60,12],[60,16,60,17],[56,6,56,7],[57,6,57,7],[58,6,58,7],[56,11,56,12],[57,11,57,12],[58,11,58,12],[123,1,123,2],[123,6,123,7],[123,11,123,12],[123,16,123,17],[124,1,124,2],[124,6,124,7],[124,11,124,12],[124,16,124,17],[130,0,147,4],[130,6,194,17],[115,0,115,2],[115,5,115,7],[115,10,115,12],[115,15,115,17],[116,1,116,2],[116,6,116,7],[116,11,116,12],[116,16,116,17],[99,0,99,2],[99,5,99,7],[99,10,99,12],[99,15,99,17],[107,0,107,2],[109,1,109,2],[110,1,110,2],[113,0,113,2],[113,5,113,7],[113,10,113,12],[113,15,113,17],[109,6,109,7],[110,6,110,7],[110,11,110,12],[110,16,110,17],[79,1,79,2],[80,1,80,2],[81,0,81,2],[81,5,81,7],[81,10,81,12],[79,16,79,17],[80,16,80,17],[81,15,81,17],[109,11,109,12],[109,16,109,17],[79,6,79,7],[80,6,80,7],[79,11,79,12],[80,11,80,12],[61,15,61,17],[68,15,68,17],[107,5,107,7],[107,10,107,12],[107,15,107,17],[25,1,25,2],[25,4,25,5],[2,0,2,1],[6,0,7,0],[8,1,8,5],[11,0,12,0],[19,0,20,0],[21,1,21,5],[22,1,22,5],[23,1,23,5],[24,1,24,5],[55,15,55,17],[61,0,61,2],[61,5,61,7],[61,10,61,12],[68,0,68,2],[68,5,68,7],[68,10,68,12],[60,1,60,2],[122,11,122,12],[122,16,122,17],[120,0,120,2],[120,5,120,7],[120,10,120,12],[118,1,118,2],[118,6,118,7],[117,11,117,12],[120,15,120,17],[121,1,121,2],[121,6,121,7],[121,11,121,12],[121,16,121,17],[122,1,122,2],[122,6,122,7],[117,16,117,17],[118,16,118,17],[119,16,119,17],[119,1,119,2],[119,6,119,7],[119,11,119,12],[117,1,117,2],[117,6,117,7],[118,11,118,12]]}
["CleanBC New Construction Incentives"]
["Energy Study Inputs"]
["Grey cells for user inputs (only where different from proposal)",null,"BC Hydro Ref # >>>",{"$f":"'2- Proposal'!D3","v":"BCH-00000"}]
[null,null,"Proposal Date  >>>",null,"Day-Month-Year"]
[]
["1. General Information"]
["Customer Information"]
[]
["Organization",{"$f":"'2- Proposal'!B10:F10","v":"Organization name"}]
["Customer",{"$f":"'2- Proposal'!B11","v":"Company Name"},{"$f":"'2- Proposal'!C11","v":"contact name"},{"$f":"'2- Proposal'!D11","v":"phone"},{"$f":"'2- Proposal'!E11","v":"email"},{"$f":"'2- Proposal'!F11","v":"address"}]
{"$rows_left_out":122}
{"sheet":"4- Study Results","index":7,"n_rows":116,"n_cols":16,"rows_kept":116,"cut":false,"hidden":false,"merged":[[49,1,49,4],[49,9,49,13],[16,1,16,4],[16,9,16,12],[10,1,10,4],[10,9,10,12],[16,6,16,8],[40,7,40,8],[41,7,41,8],[42,7,42,8],[43,7,43,8],[44,7,44,8]]}
["CleanBC New Construction Incentives"]
["Energy Study Results"]
["White, bordered cells for user inputs (if applicable)",null,"DATE of SUBMISSION >>>",null,"Day-Month-Year"]
["Different building types must have separate sub-meters for electricity and gas where applicable. Energy consumption from individual sub-meters is to be used to fill tese two tables."]
[]
[null,"Building Type 1","Building Type 2","Building Type 3","Building Type 4","TOTAL"]
[{"$f":"'1- pre screen'!A29","v":"Building Type"},{"$f":"'3- Study Inputs'!B37:C37","v":0},{"$f":"'3- Study Inputs'!G37","v":0},{"$f":"'3- Study Inputs'!L37","v":0},{"$f":"'3- Study Inputs'!Q37","v":0}]
[{"$f":"'1- pre screen'!A30","v":"Conditioned Area (m2)"},{"$f":"'3- Study Inputs'!B38:C38","v":0},{"$f":"'3- Study Inputs'!G38","v":0},{"$f":"'3- Study Inputs'!L38","v":0},{"$f":"'3- Study Inputs'!Q38","v":0},{"$f":"SUM(B8:E8)","v":0},"m2"]
[]
[]
{"$rows_left_out":107}
{"sheet":"5- Incremental Costs","index":8,"n_rows":55,"n_cols":28,"rows_kept":55,"cut":false,"hidden":false,"merged":[[4,3,4,15],[6,3,6,15],[8,3,8,15],[15,0,17,0],[23,0,25,0],[13,1,14,1],[13,3,13,8],[19,1,19,3],[15,1,17,1],[21,10,21,15],[21,1,22,1],[21,3,21,8],[45,3,45,8],[45,10,45,15],[27,1,27,3],[23,1,25,1],[29,1,30,1],[29,3,29,8],[29,10,29,15],[31,1,33,1],[35,1,35,3],[37,1,38,1],[2,0,2,7],[2,13,2,15],[54,1,54,3],[54,6,54,7],[54,13,54,14],[37,3,37,8],[37,10,37,15],[39,1,41,1],[43,1,43,3],[45,1,46,1],[51,1,51,3],[47,1,49,1],[13,10,13,15],[31,0,33,0],[39,0,41,0],[47,0,49,0]]}
["CleanBC New Construction Incentives"]
["Incremental Capital Costs"]
["White, bordered cells for user inputs (if applicable)",null,null,null,null,null,null,null,null,null,null,null,"DATE of SUBMISSION >>>",null,null,null,"Day-Month-Year"]
[null,null,null,null,null,null,null,null,null,null,null,null,null,null,null,null,null,null,null,null,null,null,null,"Hidden Y-AC"]
[null,"Project:",null,{"$f":"'1- pre screen'!B22","v":"Project Name"}]
[]
[null,"Owner:",null,{"$f":"'1- pre screen'!B12","v":"Organization name"}]
[]
[null,"Analysis by:"]
[]
{"$rows_left_out":46}
{"sheet":"Summary","index":9,"n_rows":37,"n_cols":8,"rows_kept":37,"cut":false,"hidden":false,"merged":[[0,6,0,7],[0,0,0,5],[1,0,1,2],[36,4,36,5],[32,4,32,5],[33,4,33,5],[34,4,34,5],[35,4,35,5],[4,1,4,2],[5,1,5,2],[3,1,3,5]]}
["CleanBC New Construction Incentives\nSummary report",null,null,null,null,null,{"$f":"'1- pre screen'!G1:G2","v":"CleanBC New Construction Workbook v2.0"}]
[{"$f":"IF('4- Study Results'!B19=\"\",IF('2- Proposal'!B36=\"\",\"Pre-screen\",\"Proposal\"),\"Study Report\")","v":"Pre-screen"}]
[]
["Project Name",{"$f":"'3- Study Inputs'!B22","v":"Project Name"}]
["Project Location",{"$f":"'1- pre screen'!B24:F24","v":"Site City"},null,null,"printed:",{"$f":"TODAY()","v":"2020-09-25"}]
["Project Owner",{"$f":"'3- Study Inputs'!B10","v":"Company Name"},null,null,"BC Hydro Ref #",{"$f":"'3- Study Inputs'!D3","v":"BCH-00000"}]
["Building Types",{"$f":"'3- Study Inputs'!B37:C37","v":0},{"$f":"'3- Study Inputs'!G37","v":0},{"$f":"'3- Study Inputs'!L37","v":0},{"$f":"'3- Study Inputs'!Q37","v":0},"Total Conditioned Area (m2)"]
["Conditioned Area (m2)",{"$f":"'3- Study Inputs'!B38","v":0},{"$f":"'3- Study Inputs'!G38","v":0},{"$f":"'3- Study Inputs'!L38","v":0},{"$f":"'3- Study Inputs'!Q38","v":0},{"$f":"SUM(B8:E8)","v":0}]
[]
["Net Incremental GHG Emissions ",{"$f":"'4- Study Results'!N98","v":{"$error":"#VALUE!"}},"tonneCO2e","over measures life"]
{"$rows_left_out":28}
{"sheet":"6- Baseline Hourly Results","index":10,"n_rows":2,"n_cols":1,"rows_kept":2,"cut":false,"hidden":false,"merged":[]}
["Copy/paste hourly results from your model for the whole year for electricity AND gas"]
["the table should show breakdown of end uses (e.g. lighting, heating, cooling, etc.)"]

{"sheet":"7- Proposed Hourly Results","index":11,"n_rows":2,"n_cols":1,"rows_kept":2,"cut":false,"hidden":false,"merged":[]}
["Copy/paste hourly results from your model for the whole year for electricity AND gas"]
["the table should show breakdown of end uses (e.g. lighting, heating, cooling, etc.)"]

{"sheet":"Prescreening Review","index":12,"n_rows":12,"n_cols":7,"rows_kept":12,"cut":false,"hidden":false,"merged":[[0,0,0,2]]}
["Date",null,null,"day-month-year","day-month-year","day-month-year","day-month-year"]
["Comment #","Sheet Name","Cell Reference","FIRST Review - by \nNAME\nEMAIL\nTEL","RESPONSE to First Review - by \nNAME\nEMAIL\nTEL","SECOND Review - by \nNAME\nEMAIL\nTEL","RESPONSE to Second Review - by \nNAME\nEMAIL\nTEL"]
[1]
[{"$f":"1+A3","v":2}]
[{"$f":"1+A4","v":3}]
[4]
[5]
[6]
[7]
[8]
{"$rows_left_out":3}
{"sheet":"Proposal Review","index":13,"n_rows":12,"n_cols":7,"rows_kept":12,"cut":false,"hidden":false,"merged":[[0,0,0,2]]}
["Date",null,null,"day-month-year","day-month-year","day-month-year","day-month-year"]
["Comment #","Sheet Name","Cell Reference","FIRST Review - by \nNAME\nEMAIL\nTEL","RESPONSE to First Review - by \nNAME\nEMAIL\nTEL","SECOND Review - by \nNAME\nEMAIL\nTEL","RESPONSE to Second Review - by \nNAME\nEMAIL\nTEL"]
[1]
[{"$f":"1+A3","v":2}]
[{"$f":"1+A4","v":3}]
[4]
[5]
[6]
[7]
[8]
{"$rows_left_out":3}
{"sheet":"Study Review","index":14,"n_rows":12,"n_cols":7,"rows_kept":12,"cut":false,"hidden":false,"merged":[[0,0,0,2]]}
["Date",null,null,"day-month-year","day-month-year","day-month-year","day-month-year"]
["Comment #","Sheet Name","Cell Reference","FIRST Review - by \nNAME\nEMAIL\nTEL","RESPONSE to First Review - by \nNAME\nEMAIL\nTEL","SECOND Review - by \nNAME\nEMAIL\nTEL","RESPONSE to Second Review - by \nNAME\nEMAIL\nTEL"]
[1]
[{"$f":"1+A3","v":2}]
[{"$f":"1+A4","v":3}]
[4]
[5]
[6]
[7]
[8]
{"$rows_left_out":3}
{"sheet":"Financial Model inputs","index":15,"n_rows":17,"n_cols":11,"rows_kept":17,"cut":false,"hidden":true,"merged":[]}
[]
[]
[]
[null,null,null,null,"Financial Model Inputs","Building 1","Building 2","Building 3","Building 4","TOTAL",{"$f":"E4","v":"Financial Model Inputs"}]
[null,null,null,null,"Elec Rate",{"$f":"'1- pre screen'!B45","v":0},{"$f":"'1- pre screen'!C45","v":0},{"$f":"'1- pre screen'!D45","v":0},{"$f":"'1- pre screen'!E45","v":0},{"$f":"('4- Study Results'!N104-J6*'4- Study Results'!N86)/'4- Study Results'!N79","v":{"$error":"#DIV/0!"}},"Elec Rate"]
[null,null,null,null,"Gas Rate",{"$f":"'1- pre screen'!B46","v":0},{"$f":"'1- pre screen'!C46","v":0},{"$f":"'1- pre screen'!D46","v":0},{"$f":"'1- pre screen'!E46","v":0},{"$f":"SUMPRODUCT('4- Study Results'!$B$8:$E$8,F6:I6)/'4- Study Results'!$F$8","v":{"$error":"#DIV/0!"}},"Gas Rate"]
[null,null,null,null,"Gas reduction GJ",{"$f":"'4- Study Results'!B52","v":0},{"$f":"'4- Study Results'!C52","v":0},{"$f":"'4- Study Results'!D52","v":0},{"$f":"'4- Study Results'!E52","v":0},{"$f":"SUM(F7:I7)","v":0},"Gas reduction GJ"]
[null,null,null,null,"Gas GHG reduction (tonns)",{"$f":"'4- Study Results'!B53","v":""},{"$f":"'4- Study Results'!C53","v":""},{"$f":"'4- Study Results'!D53","v":""},{"$f":"'4- Study Results'!E53","v":""},{"$f":"SUM(F8:I8)","v":0},"Gas GHG reduction (tonns)"]
[null,null,null,null,"Elect Growth kWh",{"$f":"'4- Study Results'!B51","v":0},{"$f":"'4- Study Results'!C51","v":0},{"$f":"'4- Study Results'!D51","v":0},{"$f":"'4- Study Results'!E51","v":0},{"$f":"SUM(F9:I9)","v":0},"Elect Growth kWh"]
[null,null,null,null,"Elec demand growth kW",{"$f":"'4- Study Results'!B51","v":0},{"$f":"'4- Study Results'!C51","v":0},{"$f":"'4- Study Results'!D51","v":0},{"$f":"'4- Study Results'!E51","v":0},{"$f":"SUM(G10:I10)","v":0},"Elec demand growth kW"]
{"$rows_left_out":7}